Question: Installation error - RNAPLEX
0
gravatar for kousi31
3 months ago by
kousi3110
kousi3110 wrote:

I am trying to install RNAplex software. I downloaded the source code from here

There was no error when I typed ./configure

` make`  
/home/d/happy_bin/RNAplex-0.2/lib/alicircfold.inc:80: undefined reference to `HairpinE'  
/home/d/happy_bin/RNAplex-0.2/lib/alicircfold.inc:107: undefined reference to `LoopEnergy'  
collect2: error: ld returned 1 exit status  
Makefile:240: recipe for target 'RNAplex' failed  
make[2]: *** [RNAplex] Error 1  
make[2]: Leaving directory '/home/d/happy_bin/RNAplex-0.2/Progs'  
Makefile:318: recipe for target 'all-recursive' failed  
make[1]: *** [all-recursive] Error 1  
make[1]: Leaving directory '/home/d/happy_bin/RNAplex-0.2'  
Makefile:234: recipe for target 'all' failed  
make: *** [all] Error 2

kindly help install the software.

ADD COMMENTlink modified 3 months ago by ATpoint28k • written 3 months ago by kousi3110

kousi31 : See if this helps.

ADD REPLYlink written 3 months ago by genomax76k

I installed Viennarna with bioconda. Thank you!

ADD REPLYlink written 3 months ago by kousi3110
1
gravatar for WouterDeCoster
3 months ago by
Belgium
WouterDeCoster42k wrote:

Have you tried installing with bioconda? https://anaconda.org/bioconda/viennarna

ADD COMMENTlink written 3 months ago by WouterDeCoster42k
Please log in to add an answer.

Help
Access

Use of this site constitutes acceptance of our User Agreement and Privacy Policy.
Powered by Biostar version 2.3.0
Traffic: 616 users visited in the last hour