User: alaa.khan.16

gravatar for alaa.khan.16
Reputation:
0
Status:
New User
Last seen:
1 week, 1 day ago
Joined:
1 week, 2 days ago
Email:
a***********@ucl.ac.uk

Profile information, website and location are not shown for new users.

This helps us discourage the inappropriate use of our site.

Posts by alaa.khan.16

<prev • 4 results • page 1 of 1 • next >
0
votes
2
answers
68
views
2
answers
Comment: A: AssertionError: error loading tabix index for vcf.gz file
... the first peddy command: python -m peddy -p 4 --plot --prefix Alaa_burden-2021 myFile.vcf.gz myFile.ped and from this I got AssertionError: error loading tabix index for akhan_all_samples_peddy.vcf.gz Then I used the command: tabix -p vcf myFile.vcf.gz and from this i got the error tbx_index_buil ...
written 9 days ago by alaa.khan.160
0
votes
2
answers
68
views
2
answers
Answer: A: AssertionError: error loading tabix index for vcf.gz file
... another error has appeared when i reperformed the indexing which is the present string not recognised. Not really sure how to solve this i am stick with this many days ...
written 9 days ago by alaa.khan.160
0
votes
2
answers
68
views
2
answers
Comment: A: AssertionError: error loading tabix index for vcf.gz file
... yes I tried this and i got a message tbx_index_build failed ...
written 9 days ago by alaa.khan.160
0
votes
2
answers
68
views
2
answers
AssertionError: error loading tabix index for vcf.gz file
... Dear all I am running peddy command python -m peddy -p 4 --plot --prefix ceph-1463 data/ceph1463.peddy.vcf.gz data/ceph1463.ped however each time I got an error: AssertionError: error loading tabix index for data/ceph1463.peddy.vcf.gz I make sure that I am working on the same directory where th ...
software error written 9 days ago by alaa.khan.160

Latest awards to alaa.khan.16

No awards yet. Soon to come :-)

Help
Access

Use of this site constitutes acceptance of our User Agreement and Privacy Policy.
Powered by Biostar version 2.3.0
Traffic: 1734 users visited in the last hour
_