Bam-readcount-installation error
0
0
Entering edit mode
14 months ago

Hey everyone! I'm receiving an error when I try to install Bam-readcount v1.0.1 on linux (centos7) with gcc 12.2.0 This is the error I receive in make If anyone of you can help fix this, I'd be grateful. thanks in advance for the help!!

/bin/ld: final link failed: Nonrepresentable section on output
collect2: error: ld returned 1 exit status
make[5]: *** [libcurl.la] Error 1
make[4]: *** [all] Error 2
make[3]: *** [all-recursive] Error 1
make[2]: *** [vendor/src/curl-stamp/curl-build] Error 2
make[1]: *** [CMakeFiles/curl.dir/all] Error 2
make: *** [all] Error 2
bam-readcount • 435 views
ADD COMMENT
0
Entering edit mode

Hello I have the exact same error message! Did you fix this and how if so?

ADD REPLY

Login before adding your answer.

Traffic: 1392 users visited in the last hour
Help About
FAQ
Access RSS
API
Stats

Use of this site constitutes acceptance of our User Agreement and Privacy Policy.

Powered by the version 2.3.6